{"text_format":"1","workbook":"xlsx","n_sheets":4,"sheets":["Auswahl","Berechnung","Translation","Ausdruck"],"not_rendered":{"charts":0,"images":11,"macros":1,"external_links":0,"defined_names":3,"comments":2,"pivot_tables":0},"unopened":[],"bounds":{"document_bytes":16777216,"sheet_cells":100000,"rows_first":2000,"rows_last":500,"rows_between":2000,"halvings":0,"cell_chars":16384,"cell_head_chars":4096},"cells_cut":0,"cells_raw":0,"read":"whole","date_system":"1900"}

{"sheet":"Auswahl","index":0,"n_rows":29,"n_cols":9,"rows_kept":29,"cut":false,"hidden":false,"merged":[[26,3,26,4],[28,3,28,4],[2,6,2,8],[2,24,2,27],[14,3,14,4],[4,7,4,8],[4,2,4,3],[22,2,22,3],[20,3,20,4]]}
[]
[null,{"$f":"Translation!A3","v":"Pressure loss"}]
[null,"IMT/TR 06/14"]
[]
[null,null,{"$f":"Translation!A6","v":"Input values"},null,null,null,null,{"$f":"Translation!A43","v":"Calculated values"}]
[]
[null,null,{"$f":"Translation!A7","v":"System"},null,null,null,null,{"$f":"Translation!A45","v":"Hydraulic diameter"},{"$f":"Berechnung!D97","v":"16,0 mm"}]
[]
[null,null,{"$f":"Translation!A8","v":"Medium"},null,null,null,null,{"$f":"Translation!A46","v":"Cross-section"},{"$f":"Berechnung!D98","v":"201 mm²"}]
[]
[null,null,{"$f":"Translation!A9","v":"Temperature"},null,null,null,null,{"$f":"Translation!A47","v":"Density"},{"$f":"Berechnung!D103","v":"983,2 kg/m³"}]
[]
[null,null,{"$f":"Translation!A10","v":"Pipe type"},null,null,null,null,{"$f":"Translation!A48","v":"Kinematic viscosity"},{"$f":"Berechnung!D104","v":"0,5 mm²/s"}]
[]
[null,null,{"$f":"IF(Berechnung!G5=Berechnung!H11,Berechnung!D125,Translation!A11)","v":"Diameter"},"x",null,null,null,{"$f":"Translation!A49","v":"Reynolds number"},{"$f":"Berechnung!D105","v":"7.368.284"}]
[]
[null,null,{"$f":"Translation!A14&\" | \"&Translation!A16","v":"Volume flow | unit"},160,null,null,null,{"$f":"Translation!A51","v":"Flow type"},{"$f":"Berechnung!D113","v":"Turbulent | Transition zone"}]
[]
[null,null,{"$f":"Translation!A15&\" | \"&Translation!A16","v":"Pipe length | unit"},10,null,null,null,{"$f":"Translation!A52","v":"Pipe-friction "},{"$f":"Berechnung!D117","v":"0,0121"}]
[]
[null,null,{"$f":"Translation!A59&\" \"&Translation!A58","v":"Sum Zeta-values"},0,null,null,null,{"$f":"Translation!A50","v":"Surface roughness"},{"$f":"Berechnung!D106","v":"0,002 mm"}]
[]
[null,null,{"$f":"Translation!A17","v":"Results"},null,null,null,null,{"$f":"Translation!A3&\" \"&Translation!A4","v":"Pressure loss Pipe system"},{"$f":"Berechnung!D119","v":"1.815.194,47 mbar"}]
[]
[null,null,{"$f":"Translation!A3&\" | \"&Translation!A16","v":"Pressure loss | unit"},{"$f":"Berechnung!D122","v":"1.815.194,47"},null,null,null,{"$f":"Translation!A3&\" \"&Translation!A58","v":"Pressure loss Zeta-values"},{"$f":"Berechnung!D121","v":"0,00 mbar"}]
[]
[null,null,{"$f":"Translation!A22","v":"Speed"},{"$f":"Berechnung!D102","v":"221,05 m/s"}]
[]
[null,null,{"$f":"Translation!A23","v":"Capacity"},{"$f":"IF(Berechnung!W5=Berechnung!W7,Berechnung!D123,Berechnung!D124)","v":"2,01 Litres"}]

{"sheet":"Berechnung","index":1,"n_rows":127,"n_cols":41,"rows_kept":127,"cut":false,"hidden":true,"merged":[[39,37,39,40],[2,18,2,21],[2,12,2,14],[2,15,2,17],[39,24,39,27],[39,12,39,15],[39,16,39,19],[39,20,39,23],[39,33,39,36],[2,23,2,24],[4,1,4,4],[2,1,2,4],[4,6,4,9],[39,8,39,11],[2,6,2,11],[39,0,39,3],[39,4,39,7],[82,1,82,2],[82,3,82,4],[82,5,82,6],[82,7,82,8],[82,9,82,10],[82,31,82,32],[82,15,82,16],[82,17,82,18],[82,25,82,26],[39,28,39,32],[82,21,82,22],[82,23,82,24],[82,27,82,28],[82,19,82,20],[112,4,112,5],[108,4,108,5],[82,29,82,30],[82,11,82,12],[82,13,82,14]]}
[]
["Comboboxen"]
["Anwendung","Medium",null,null,null,"Temperatur","Rohrart",null,null,null,null,null,"Volumenstrom",null,null,"Rohrlänge",null,null,"Druckverlust",null,null,null,"Ergebnisse","Sprache",null,"Iteration"]
[null,"Heizung","Lüftung","Sole","Solar",null,"Heizung","Lüftung","Sole","Solar","Nennweite","Rundrohr ?","Wert","Einheit","in m³/s","Wert","Einheit","in m",null,null,"absolut","Umrechnung",null,"Nummer","Wert","Lambda-Übergang"]
["Heating system","Water",null,null,null,"60 °C","Copper pipe",null,null,null,"Cu 18 x 1,0",{"$f":"IF(G5=H11,FALSE,TRUE)","v":true},{"$f":"Auswahl!D17","v":160},"m³ / h",{"$f":"M5/VLOOKUP(N5,N6:O37,2,FALSE)","v":4.4444444444444446E-2},{"$f":"Auswahl!D19","v":10},"m",{"$f":"P5/VLOOKUP(Q5,Q6:R37,2,FALSE)","v":10},null,null,"mbar",{"$f":"VLOOKUP(U5,U6:V37,2,FALSE)","v":1},"Absolute Werte",2,{"$f":"VLOOKUP(X5,X6:Y37,2,FALSE)","v":"| English"},{"$f":"Z36","v":1.2090826762113678E-2}]
[]
[{"$f":"Translation!A24","v":"Heating system"},{"$f":"Translation!A28","v":"Water"},{"$f":"Translation!A29","v":"Air"},{"$f":"Translation!$A$30&\" 10 %\"","v":"Ethylen glycol 10 %"},"Tyfocor H-30 L","0 °C",{"$f":"Translation!A32","v":"Copper pipe"},{"$f":"Translation!A35","v":"Folded pipe"},{"$f":"Translation!A33","v":"PE-Pipe"},{"$f":"Translation!A32","v":"Copper pipe"},null,null,null,"m³ / h",3600,null,"m",1,null,null,"mbar",1,{"$f":"Translation!A19","v":"Specific values"},1,"| Deutsch",{"$f":"(1/(-2*LOG10((2.51/($C$105*SQRT(0.03)))+($C$106/(3.71*$C$97)))))^2","v":1.1997384228101919E-2}]
[{"$f":"Translation!A26","v":"Heat source system"},null,null,{"$f":"Translation!$A$30&\" 20 %\"","v":"Ethylen glycol 20 %"},null,"20 °C",{"$f":"Translation!A33","v":"PE-Pipe"},{"$f":"Translation!A36","v":"Flat duct LFK"},{"$f":"Translation!A32","v":"Copper pipe"},{"$f":"Translation!A41","v":"Solar flex pipe"},null,null,null,"m³ / min",60,null,"mm",1000,null,null,"bar",1000,{"$f":"Translation!A20","v":"Total values"},2,"| English",{"$f":"(1/(-2*LOG10((2.51/($C$105*SQRT(Z7)))+($C$106/(3.71*$C$97)))))^2","v":1.2091806940865771E-2}]
[{"$f":"Translation!A27","v":"Solar system"},null,null,{"$f":"Translation!$A$30&\" 30 %\"","v":"Ethylen glycol 30 %"},null,"40 °C",{"$f":"Translation!A34","v":"Steel pipe"},{"$f":"Translation!A40","v":"Pluggit-System"},{"$f":"Translation!A34","v":"Steel pipe"},null,null,null,null,"m³ / s",1,null,"cm",100,null,null,"Pa",0.01,null,3,"| Nederlands",1.2090816539081305E-2]
[{"$f":"Translation!A25","v":"Ventilation system"},null,null,{"$f":"Translation!$A$30&\" 40 %\"","v":"Ethylen glycol 40 %"},null,"60 °C",null,{"$f":"Translation!A38","v":"Flexible pipe LVS"},null,null,null,null,null,"l / h",3600000,null,null,null,null,null,"hPa",1,null,4,"| Francais",1.2090826868743866E-2]
[null,null,null,{"$f":"Translation!$A$30&\" 50 %\"","v":"Ethylen glycol 50 %"},null,"80 °C",null,{"$f":"Translation!A39","v":"Rectangle duct"},null,null,null,null,null,"l / min",60000,null,null,null,null,null,"kPa",10,null,5,"| Suomi",1.2090826761001488E-2]
[null,null,null,{"$f":"Translation!$A$30&\" 60 %\"","v":"Ethylen glycol 60 %"},null,null,null,{"$f":"Translation!A37","v":"Flexible duct LVE"},null,null,null,null,null,"l / s",1000,null,null,null,null,null,"mWS",98.066999999999993,null,6,"| Dansk",1.2090826762125279E-2]
[null,null,null,{"$f":"Translation!$A$31&\" 20 %\"","v":"Ethanol 20 %"},null,null,null,null,null,null,null,null,null,null,null,null,null,null,null,null,"mmWS",9.8068000000000002E-2,null,null,null,1.2090826762113555E-2]
[null,null,null,{"$f":"Translation!$A$31&\" 30 %\"","v":"Ethanol 30 %"},null,null,null,null,null,null,null,null,null,null,null,null,null,null,null,null,null,null,null,null,null,1.2090826762113678E-2]
[null,null,null,{"$f":"Translation!$A$31&\" 40 %\"","v":"Ethanol 40 %"},null,null,null,null,null,null,null,null,null,null,null,null,null,null,null,null,null,null,null,null,null,1.2090826762113678E-2]
[null,null,null,{"$f":"Translation!$A$31&\" 50 %\"","v":"Ethanol 50 %"},null,null,null,null,null,null,null,null,null,null,null,null,null,null,null,null,null,null,null,null,null,1.2090826762113678E-2]
[null,null,null,null,null,null,null,null,null,null,null,null,null,null,null,null,null,null,null,null,null,null,null,null,null,1.2090826762113678E-2]
[null,null,null,null,null,null,null,null,null,null,null,null,null,null,null,null,null,null,null,null,null,null,null,null,null,1.2090826762113678E-2]
[null,null,null,null,null,null,null,null,null,null,null,null,null,null,null,null,null,null,null,null,null,null,null,null,null,1.2090826762113678E-2]
[null,null,null,null,null,null,null,null,null,null,null,null,null,null,null,null,null,null,null,null,null,null,null,null,null,1.2090826762113678E-2]
[null,null,null,null,null,null,null,null,null,null,null,null,null,null,null,null,null,null,null,null,null,null,null,null,null,1.2090826762113678E-2]
[null,null,null,null,null,null,null,null,null,null,null,null,null,null,null,null,null,null,null,null,null,null,null,null,null,1.2090826762113678E-2]
[null,null,null,null,null,null,null,null,null,null,null,null,null,null,null,null,null,null,null,null,null,null,null,null,null,1.2090826762113678E-2]
[null,null,null,null,null,null,null,null,null,null,null,null,null,null,null,null,null,null,null,null,null,null,null,null,null,1.2090826762113678E-2]
[null,null,null,null,null,null,null,null,null,null,null,null,null,null,null,null,null,null,null,null,null,null,null,null,null,1.2090826762113678E-2]
[null,null,null,null,null,null,null,null,null,null,null,null,null,null,null,null,null,null,null,null,null,null,null,null,null,1.2090826762113678E-2]
[null,null,null,null,null,null,null,null,null,null,null,null,null,null,null,null,null,null,null,null,null,null,null,null,null,1.2090826762113678E-2]
[null,null,null,null,null,null,null,null,null,null,null,null,null,null,null,null,null,null,null,null,null,null,null,null,null,1.2090826762113678E-2]
[null,null,null,null,null,null,null,null,null,null,null,null,null,null,null,null,null,null,null,null,null,null,null,null,null,1.2090826762113678E-2]
[null,null,null,null,null,null,null,null,null,null,null,null,null,null,null,null,null,null,null,null,null,null,null,null,null,1.2090826762113678E-2]
[null,null,null,null,null,null,null,null,null,null,null,null,null,null,null,null,null,null,null,null,null,null,null,null,null,1.2090826762113678E-2]
[null,null,null,null,null,null,null,null,null,null,null,null,null,null,null,null,null,null,null,null,null,null,null,null,null,1.2090826762113678E-2]
[null,null,null,null,null,null,null,null,null,null,null,null,null,null,null,null,null,null,null,null,null,null,null,null,null,1.2090826762113678E-2]
[null,null,null,null,null,null,null,null,null,null,null,null,null,null,null,null,null,null,null,null,null,null,null,null,null,1.2090826762113678E-2]
[null,null,null,null,null,null,null,null,null,null,null,null,null,null,null,null,null,null,null,null,null,null,null,null,"(VBA-Abfrage)",1.2090826762113678E-2]
[null,null,null,null,null,null,null,null,null,null,null,null,null,null,null,null,null,null,null,null,null,null,null,null,"FI gewählt?",1.2090826762113678E-2]
[null,null,null,null,null,null,null,null,null,null,null,null,null,null,null,null,null,null,null,null,null,null,null,null,{"$f":"IF(Y5=Y11,TRUE,FALSE)","v":false}]
[]
["Nennweiten"]
[{"$f":"G7","v":"Copper pipe"},null,null,null,{"$f":"G8","v":"PE-Pipe"},null,null,null,{"$f":"G9","v":"Steel pipe"},null,null,null,{"$f":"H7","v":"Folded pipe"},null,null,null,{"$f":"H8","v":"Flat duct LFK"},null,null,null,{"$f":"H9","v":"Pluggit-System"},null,null,null,{"$f":"H10","v":"Flexible pipe LVS"},null,null,null,{"$f":"H11","v":"Rectangle duct"},null,null,null,null,{"$f":"J8","v":"Solar flex pipe"},null,null,null,{"$f":"H12","v":"Flexible duct LVE"}]
["Nennweite","d-innen","Querschnitt","Rauhigkeit","Nennweite","d-innen","Querschnitt","Rauhigkeit","Nennweite","d-innen","Querschnitt","Rauhigkeit","Nennweite","d-innen","Querschnitt","Rauhigkeit","Nennweite","Fläche","dHydr","Rauhigkeit","Nennweite","Fläche","dHydr","Rauhigkeit","Nennweite","d-innen","Querschnitt","Rauhigkeit","Breite","Höhe","Fläche","dHydr","Rauhigkeit","Nennweite","d-innen","Querschnitt","Rauhigkeit","Nennweite","Fläche","dHydr","Rauhigkeit"]
[{"$f":"$K$5","v":"Cu 18 x 1,0"},{"$f":"VLOOKUP(A42,A43:B80,2,FALSE)","v":1.6E-2},{"$f":"VLOOKUP(A42,A43:C80,3,FALSE)","v":2.0106192982974675E-4},1.5E-3,{"$f":"$K$5","v":"Cu 18 x 1,0"},{"$f":"VLOOKUP(E42,E43:F80,2,FALSE)","v":{"$error":"#N/A"}},{"$f":"VLOOKUP(E42,E43:G80,3,FALSE)","v":{"$error":"#N/A"}},7.0000000000000001E-3,{"$f":"$K$5","v":"Cu 18 x 1,0"},{"$f":"VLOOKUP(I42,I43:J80,2,FALSE)","v":{"$error":"#N/A"}},{"$f":"VLOOKUP(I42,I43:K80,3,FALSE)","v":{"$error":"#N/A"}},0.02,{"$f":"$K$5","v":"Cu 18 x 1,0"},{"$f":"VLOOKUP(M42,M43:N80,2,FALSE)","v":{"$error":"#N/A"}},{"$f":"VLOOKUP(M42,M43:O80,3,FALSE)","v":{"$error":"#N/A"}},0.1,{"$f":"$K$5","v":"Cu 18 x 1,0"},{"$f":"VLOOKUP(Q42,Q43:R80,2,FALSE)","v":{"$error":"#N/A"}},{"$f":"VLOOKUP(Q42,Q43:S80,3,FALSE)","v":{"$error":"#N/A"}},0.15,{"$f":"$K$5","v":"Cu 18 x 1,0"},{"$f":"VLOOKUP(U42,U43:V80,2,FALSE)","v":{"$error":"#N/A"}},{"$f":"VLOOKUP(U42,U43:W80,3,FALSE)","v":{"$error":"#N/A"}},{"$f":"VLOOKUP(U42,U43:X80,4,FALSE)","v":{"$error":"#N/A"}},{"$f":"$K$5","v":"Cu 18 x 1,0"},{"$f":"VLOOKUP(Y42,Y43:Z80,2,FALSE)","v":{"$error":"#N/A"}},{"$f":"VLOOKUP(Y42,Y43:AA80,3,FALSE)","v":{"$error":"#N/A"}},{"$f":"VLOOKUP(Y42,Y43:AB80,4,FALSE)","v":{"$error":"#N/A"}},{"$f":"AC44/1000","v":0.13},{"$f":"AD44/1000","v":5.1999999999999998E-2},{"$f":"AC42*AD42","v":6.7599999999999995E-3},{"$f":"2*AE42/(AC42+AD42)","v":7.4285714285714288E-2},0.15,{"$f":"$K$5","v":"Cu 18 x 1,0"},{"$f":"VLOOKUP(AH42,AH43:AI80,2,FALSE)","v":{"$error":"#N/A"}},{"$f":"VLOOKUP(AH42,AH43:AJ80,3,FALSE)","v":{"$error":"#N/A"}},1.365,{"$f":"$K$5","v":"Cu 18 x 1,0"},{"$f":"VLOOKUP($AL$42,$AL$43:$AO$80,2,FALSE)","v":{"$error":"#N/A"}},{"$f":"VLOOKUP($AL$42,$AL$43:$AO$80,3,FALSE)","v":{"$error":"#N/A"}},{"$f":"VLOOKUP($AL$42,$AL$43:$AO$80,4,FALSE)","v":{"$error":"#N/A"}}]
[]
["Cu 18 x 1,0",1.6E-2,2.0106192982974675E-4,null,"DN 20 (25 x 2,3)",2.0399999999999998E-2,3.2685129967948199E-4,null,"DN 20 (27 x 2,7) - ¾ Zoll",2.1599999999999998E-2,3.6643536711471344E-4,null,"DN 80",0.08,5.0265482457436689E-3,null,"Kanal 50 x 100",5.0450899999999995E-3,6.6999867197875151E-2,null,"PK 100 (92 x 50)",3.825557368467721E-3,8.9071862124765214E-2,11,"LVS 75 mm",6.4000000000000001E-2,3.2169908772759479E-3,0.41,"130","52",null,null,null,{"$f":"Translation!A42&\" DN 20\"","v":"Flex pipe DN 20"},1.9699999999999999E-2,3.0480517323291565E-4,null,"130 x 52 mm",4.15E-3,0.06,7.0000000000000007E-2]
["Cu 22 x 1,0",0.02,3.1415926535897931E-4,null,{"$f":"IF(Y37=TRUE,\"DN 25 (32 x 2,0)\",\"DN 25 (32 x 2,9)\")","v":"DN 25 (32 x 2,9)"},{"$f":"IF(Y37=TRUE,0.028,0.0262)","v":2.6200000000000001E-2},{"$f":"IF(Y37=TRUE,0.000615752160103599,0.000539128715282544)","v":5.3912871528254396E-4},null,"DN 25 (34 x 3,3) - 1 Zoll",2.7200000000000002E-2,5.810689772079682E-4,null,"DN 100",0.1,7.8539816339744835E-3,null,"Kanal 50 x 150",7.5600899999999993E-3,7.5374775672981051E-2,null,"PK 150 (113 x 50)",4.8335573684677212E-3,0.10605927736147237,24,"LVS 90 mm",7.7499999999999999E-2,4.717297718905924E-3,0.57999999999999996]
["Cu 28 x 1,5",2.5000000000000001E-2,4.9087385212340522E-4,null,{"$f":"IF(Y37=TRUE,\"DN 32 (40 x 2,4)\",\"DN 32 (40 x 3,7)\")","v":"DN 32 (40 x 3,7)"},{"$f":"IF(Y37=TRUE,0.0352,0.0326)","v":3.2599999999999997E-2},{"$f":"IF(Y37=TRUE,0.000973139740375974,0.000834689752132272)","v":8.3468975213227205E-4},null,"DN 32 (42 x 3,3) - 1¼ Zoll",3.5900000000000001E-2,1.0122290069682653E-3,null,"DN 125",0.125,1.2271846303085129E-2,null,"Kanal 50 x 200",1.007509E-2,8.0407741420590581E-2,null,"PK 200 (172 x 57)",8.7008294442772818E-3,0.15112979765116274,45]
["Cu 35 x 1,5",3.2000000000000001E-2,8.0424771931898698E-4,null,"DN 40 (50 x 4,6)",4.0799999999999996E-2,1.3074051987179279E-3,null,"DN 40 (48 x 3,3) - 1½ Zoll",4.1799999999999997E-2,1.3722790870145574E-3,null,"DN 150",0.15,1.7671458676442587E-2,null,"Kanal 80 x 200",1.6084089999999999E-2,0.11464069850320739]
["Cu 42 x 1,5",3.9E-2,1.1945906065275189E-3,null,"DN 50 (63 x 5,8)",5.1400000000000001E-2,2.0749905317695226E-3,null,"DN 50 (60 x 3,7) - 2 Zoll",5.2999999999999999E-2,2.2061834409834321E-3,null,"DN 160",0.16,2.0106192982974676E-2]
["Cu 54 x 2,0",0.05,1.9634954084936209E-3,null,"DN 65 (75 x 6,8)",6.1399999999999996E-2,2.960919660081844E-3,null,"DN 65 (76 x 3,7) - 2½ Zoll",6.88E-2,3.7176350825520177E-3,null,"DN 200",0.2,3.1415926535897934E-2]
["Cu 76,1 x 2,0",7.2099999999999997E-2,4.0828216665869293E-3,null,"DN 80 (90 x 8,2)",7.3599999999999999E-2,4.2544704351974412E-3,null,"DN 80 (89 x 4,1) - 3 Zoll",8.0800000000000011E-2,5.1275818654831174E-3,null,"DN 250",0.25,4.9087385212340517E-2]
["Cu 88,9 x 2,0",8.4900000000000003E-2,5.661157815750442E-3,null,"DN 100 (125 x 11,4)",0.1022,8.203358152980204E-3,null,"DN 100 (114 x 4,5) - 4 Zoll",0.10529999999999999,8.7085655215856112E-3,null,"DN 315",0.315,7.793113276311181E-2]
["Cu 108 x 2,5",0.10299999999999999,8.3322891154835269E-3,null,"DN 125 (160 x 14,6)",0.1308,1.3437094434228121E-2,null,"DN 125 (140 x 4,9) - 5 Zoll",0.13,1.3273228961416878E-2,null,"DN 400",0.4,0.12566370614359174]
["Cu 133 x 3,0",0.127,1.2667686977437444E-2,null,"DN 150 (180 x 16,4)",0.1472,1.7017881740789765E-2,null,"DN 150 (165 x 4,9) - 6 Zoll",0.15540000000000001,1.8966705911591126E-2,null,"DN 500",0.5,0.19634954084936207]
["Cu 159 x 3,0",0.153,1.8385385606970867E-2,null,"DN 160 (200 x 18,2)",0.1636,2.1021150427406165E-2,null,null,null,null,null,"DN 560",0.56000000000000005,0.2463008640414398]
["Cu 219 x 3,0",0.21299999999999999,3.5632729275178833E-2,null,"DN 180 (225 x 20,5)",0.184,2.6590440219984007E-2,null,null,null,null,null,"DN 630",0.63,0.31172453105244724]
["Cu 267 x 3,0",0.26100000000000001,5.3502108288797576E-2,null,"DN 200 (250 x 22,7)",0.2046,3.2877678181686729E-2,null,null,null,null,null,"DN 800",0.8,0.50265482457436694]
[null,null,null,null,"DN 225 (280 x 25,4)",0.22919999999999999,4.1259038974419321E-2,null,null,null,null,null,"DN 1000",1,0.78539816339744828]
[null,null,null,null,"DN 250 (315 x 28,6)",0.25780000000000003,5.2198221673851686E-2]
[]
[]
[]
[]
[]
[]
[]
[]
[]
[]
[]
[]
[]
[]
[]
[]
[]
[]
[]
[]
[]
[]
[]
["Stoffdaten"]
["Temperatur",{"$f":"B7","v":"Water"},null,{"$f":"C7","v":"Air"},null,{"$f":"D7","v":"Ethylen glycol 10 %"},null,{"$f":"D8","v":"Ethylen glycol 20 %"},null,{"$f":"D9","v":"Ethylen glycol 30 %"},null,{"$f":"D10","v":"Ethylen glycol 40 %"},null,{"$f":"D11","v":"Ethylen glycol 50 %"},null,{"$f":"D12","v":"Ethylen glycol 60 %"},null,{"$f":"D13","v":"Ethanol 20 %"},null,{"$f":"D14","v":"Ethanol 30 %"},null,{"$f":"D15","v":"Ethanol 40 %"},null,{"$f":"D16","v":"Ethanol 50 %"},null,{"$f":"E7","v":"Tyfocor H-30 L"}]
[null,"Dichte","Viskosität *10^6","Dichte","Viskosität","Dichte","Viskosität","Dichte","Viskosität","Dichte","Viskosität","Dichte","Viskosität","Dichte","Viskosität","Dichte","Viskosität","Dichte","Viskosität","Dichte","Viskosität","Dichte","Viskosität","Dichte","Viskosität","Dichte","Viskosität"]
[{"$f":"F7","v":"0 °C"},999.84,1.79,1.2929999999999999,13.2,1018,2.2999999999999998,1035,3.1,1052,4.3,1069,6.1,1084,8.6,1097,13.6,976,17.3,965,1.73,949,1.74,929,1.74,1053,13]
[{"$f":"F8","v":"20 °C"},998.3,1.01,1.2050000000000001,15,null,null,null,null,null,null,null,null,null,null,null,null,null,null,null,null,null,null,null,null,1043,5.22]
["40 °C",992.3,0.66,1.1279999999999999,16.899999999999999,null,null,null,null,null,null,null,null,null,null,null,null,null,null,null,null,null,null,null,null,1030,2.6]
["60 °C",983.2,0.48,1.06,18.899999999999999,null,null,null,null,null,null,null,null,null,null,null,null,null,null,null,null,null,null,null,null,1017,1.8]
["80 °C",971.6,0.37,0.999,20.9,null,null,null,null,null,null,null,null,null,null,null,null,null,null,null,null,null,null,null,null,1002,1.1000000000000001]
["Dichte Gewählt",{"$f":"VLOOKUP($F$5,$A$85:B89,2,FALSE)","v":983.2},null,{"$f":"VLOOKUP($F$5,$A$85:D89,4,FALSE)","v":1.06},null,{"$f":"VLOOKUP($F$5,$A$85:F89,6,FALSE)","v":0},null,{"$f":"VLOOKUP($F$5,$A$85:H89,8,FALSE)","v":0},null,{"$f":"VLOOKUP($F$5,$A$85:J89,10,FALSE)","v":0},null,{"$f":"VLOOKUP($F$5,$A$85:L89,12,FALSE)","v":0},null,{"$f":"VLOOKUP($F$5,$A$85:N89,14,FALSE)","v":0},null,{"$f":"VLOOKUP($F$5,$A$85:P89,16,FALSE)","v":0},null,{"$f":"VLOOKUP($F$5,$A$85:R89,18,FALSE)","v":0},null,{"$f":"VLOOKUP($F$5,$A$85:T89,20,FALSE)","v":0},null,{"$f":"VLOOKUP($F$5,$A$85:V89,22,FALSE)","v":0},null,{"$f":"VLOOKUP($F$5,$A$85:X89,24,FALSE)","v":0},null,{"$f":"VLOOKUP($F$5,$A$85:Z89,26,FALSE)","v":1017}]
["Viskosität Gewählt",{"$f":"VLOOKUP($F$5,$A$85:C89,3,FALSE)","v":0.48},null,{"$f":"VLOOKUP($F$5,$A$85:E89,5,FALSE)","v":18.899999999999999},null,{"$f":"VLOOKUP($F$5,$A$85:G89,7,FALSE)","v":0},null,{"$f":"VLOOKUP($F$5,$A$85:I89,9,FALSE)","v":0},null,{"$f":"VLOOKUP($F$5,$A$85:K89,11,FALSE)","v":0},null,{"$f":"VLOOKUP($F$5,$A$85:M89,13,FALSE)","v":0},null,{"$f":"VLOOKUP($F$5,$A$85:O89,15,FALSE)","v":0},null,{"$f":"VLOOKUP($F$5,$A$85:Q89,17,FALSE)","v":0},null,{"$f":"VLOOKUP($F$5,$A$85:S89,19,FALSE)","v":0},null,{"$f":"VLOOKUP($F$5,$A$85:U89,21,FALSE)","v":0},null,{"$f":"VLOOKUP($F$5,$A$85:W89,23,FALSE)","v":0},null,{"$f":"VLOOKUP($F$5,$A$85:Y89,25,FALSE)","v":0},null,{"$f":"VLOOKUP($F$5,$A$85:AG89,27,FALSE)","v":1.8}]
[]
[]
["Berechnungen"]
["Wert","Einheit","Rundrohr","Übergabe Ergebnis"]
[]
["dInnen / dHydr","m",{"$f":"IF(G5=A40,B42,IF(G5=E40,F42,IF(G5=I40,J42,IF(G5=M40,N42,IF(G5=Q40,S42,IF(G5=U40,W42,IF(G5=AC40,AF42,IF(G5=Y40,Z42,IF(G5=AH40,AI42,AN42)))))))))","v":1.6E-2},{"$f":"FIXED(C97*1000,1)&\" mm\"","v":"16,0 mm"}]
["Querschnitt","m²",{"$f":"IF(G5=A40,C42,IF(G5=E40,G42,IF(G5=I40,K42,IF(G5=M40,O42,IF(G5=Q40,R42,IF(G5=U40,V42,IF(G5=AC40,AE42,IF(G5=Y40,AA42,IF(G5=AH40,AJ42,AM42)))))))))","v":2.0106192982974675E-4},{"$f":"FIXED(C98*1000000,0)&\" mm²\"","v":"201 mm²"}]
["Länge","m",{"$f":"R5","v":10}]
["Zeta-Wert","-",{"$f":"Auswahl!D21","v":0},{"$f":"C100","v":0}]
["Volumenstrom","m³/s",{"$f":"O5","v":4.4444444444444446E-2}]
["Geschwindigkeit","m/s",{"$f":"C101/C98","v":221.04853207207688},{"$f":"FIXED(C102,2)&\" m/s\"","v":"221,05 m/s"}]
["Dichte","kg/m³",{"$f":"HLOOKUP(B5,B83:AG90,8,FALSE)","v":983.2},{"$f":"FIXED(C103,1)&\" kg/m³\"","v":"983,2 kg/m³"}]
["Viskosität","m²/s",{"$f":"HLOOKUP(B5,B83:AI91,9,FALSE)/10^6","v":4.7999999999999996E-7},{"$f":"FIXED(C104*1000000,1)&\" mm²/s\"","v":"0,5 mm²/s"}]
["Reynolds","-",{"$f":"C102*C97/C104","v":7368284.402402564},{"$f":"FIXED(C105,0)","v":"7.368.284"}]
["Rauhigkeit","m",{"$f":"IF(G5=A40,D42,IF(G5=E40,H42,IF(G5=I40,L42,IF(G5=M40,P42,IF(G5=Q40,T42,IF(G5=U40,X42,IF(G5=AC40,AG42,IF(G5=Y40,AB42,IF(G5=AH40,AK42,AO42)))))))))/1000","v":1.5E-6},{"$f":"FIXED(C106*1000,3)&\" mm\"","v":"0,002 mm"}]
["Term 1 (Grenze glatt)","-",{"$f":"(C97/C106)*LOG10(0.1*C97/C106)","v":32298.973051735931}]
["Term 2 (Grenze rauh)","-",{"$f":"400*(C97/C106)*LOG10(3.715*C97/C106)","v":19618080.177906502}]
["Laminar?","-",{"$f":"IF(C105<2320,TRUE,FALSE)","v":false},{"$f":"IF(C109=TRUE,Translation!A53,FALSE)","v":false}]
["Hydr. glatt ?","-",{"$f":"IF(AND(C105>=2320,C105<C107),TRUE,FALSE)","v":false},{"$f":"IF(C110=TRUE,Translation!A54,FALSE)","v":false}]
["Übergang ?","-",{"$f":"IF(AND(C105>C107,C105<C108),TRUE,FALSE)","v":true},{"$f":"IF(C111=TRUE,Translation!A55,FALSE)","v":"Turbulent | Transition zone"}]
["Hydr. rauh ?","-",{"$f":"IF(C105>C108,TRUE,FALSE)","v":false},{"$f":"IF(C112=TRUE,Translation!A56,FALSE)","v":false}]
["Lamba laminar (I)","-",{"$f":"64/C105","v":8.6858753686450585E-6},{"$f":"IF(D109<>FALSE,D109,IF(D110<>FALSE,D110,IF(D111<>FALSE,D111,IF(D112<>FALSE,D112))))","v":"Turbulent | Transition zone"}]
["Lambda hydr. Glatt (II)","-",{"$f":"0.309/((LOG10(C105/7))^2)","v":8.5199740810997671E-3}]
["Lamba Übergang (III)","-",{"$f":"Z5","v":1.2090826762113678E-2}]
["Lamba hydr. rauh (IV)","-",{"$f":"0.25/(LOG10(3.715*C97/C106))^2","v":1.1825089276949663E-2}]
["Lambda gewählt","-",{"$f":"IF(C109=TRUE,C113,IF(C110=TRUE,C114,IF(C111=TRUE,C115,IF(C112=TRUE,C116))))","v":1.2090826762113678E-2},{"$f":"FIXED(C117,4)","v":"0,0121"}]
["Druckverlust Rohr","mbar",{"$f":"((C117*C99/C97)*(C103/2)*C102^2)*0.01","v":1815194.4733627236}]
["Druckverlust Rohr","gewählte Einheit",{"$f":"C118/V5","v":1815194.4733627236},{"$f":"FIXED(C119,2)&\" \"&U5","v":"1.815.194,47 mbar"}]
["Druckverlust Zeta","mbar",{"$f":"0.01*(C100*0.5*C103*C102^2)","v":0}]
["Druckverlust Zeta","gewählte Einheit",{"$f":"C120/V5","v":0},{"$f":"FIXED(C121,2)&\" \"&U5","v":"0,00 mbar"}]
["Summe Druckverlust","gewählte Einheit",{"$f":"C119+C121","v":1815194.4733627236},{"$f":"FIXED(C122,2)","v":"1.815.194,47"}]
["Inhalt","l/m",{"$f":"C98*1000","v":0.20106192982974674},{"$f":"FIXED(C123,2)&\" \"&Translation!A61","v":"0,20 Litres/m"}]
["Inhalt","l",{"$f":"C98*C99*1000","v":2.0106192982974673},{"$f":"FIXED(C124,2)&\" \"&Translation!A60","v":"2,01 Litres"}]
["Ausgabe Kanal",null,null,{"$f":"Translation!A12&\" [mm] x \"&Translation!A13&\"[mm]\"","v":"Width [mm] x Height[mm]"}]
["Ausgbe Rechenwerte",null,null,{"$f":"\"| \"&Translation!A43","v":"| Calculated values"}]
["Ausgabe Druck",null,null,{"$f":"\"| \"&Translation!A57","v":"| Printout"}]

{"sheet":"Translation","index":2,"n_rows":426,"n_cols":7,"rows_kept":426,"cut":false,"hidden":true,"merged":[]}
[]
["English","Deutsch","English","Nederlands","Francais","Suomi","Dansk"]
["Pressure loss","Druckverlust","Pressure loss","Drukverlies","Perte de pression","Painehäviöt","Tryktab"]
["Pipe system","Rohrleitung","Pipe system","Leiding","système de tuyauterie","Putkijärjestelmä","Rørsystem"]
["Project","Projekt","Project","Project","Projet","Projekti","Projekt"]
["Input values","Eingabewerte","Input values","Ingevoerde waarden","valeurs d'entrée","Syötetyt arvot","Input værdier"]
["System","System","System","Systeem","système   ","Järjestelmä","System"]
["Medium","Medium","Medium","Medium","medium","Neste","Medie"]
["Temperature","Temperatur","Temperature","Temperatuur","température","Nesteen lämpötila","Temperatur"]
["Pipe type","Rohrart","Pipe type","Leidingsoort","type de tuyauterie","Putkityyppi","Rørtype"]
["Diameter","Nennweite","Diameter","Nominale maat","diamètre","Halkaisija","Diameter"]
["Width","Breite","Width","Breedte","largeur","Leveys","Bredde"]
["Height","Höhe","Height","Hoogte","hauteur","Korkeus","Højde"]
["Volume flow","Volumenstrom","Volume flow","Volumestroom","débit","Tilavuusvirta","Volumenflow"]
["Pipe length","Rohrlänge","Pipe length","Leidinglengte","longeur tuyauterie","Putken pituus","Rørlængde"]
["unit","Einheit","unit","Eenheid","unité","yksikkö","Enhed"]
["Results","Ergebnisse","Results","Resultaten","Résultats","Tulokset","Resultat"]
["Values","Anzeige","Values","Tonen","Valeurs  ","Arvot","Værdier"]
["Specific values","Spezifische Werte","Specific values","Specifieke waarden","Valeurs spécifiques","Erityisarvot","Specifikke værdier"]
["Total values","Absolute Werte","Total values","Absolute waarden","Valeurs totales","Yhteisarvot","Absolutte værdier"]
["Pressure loss","Druckverlust","Pressure loss","Drukverlies","perte de pression","Painehäviöt","Tryktab"]
["Speed","Geschwindigkeit","Speed","Snelheid","vitesse","Nopeus","Hastighed"]
["Capacity","Rohrinhalt","Capacity","Leidinginhoud","capacité","Tilavuus","Kapacitet"]
["Heating system","Heizungsanlage","Heating system","Verwarmingssysteem","système de chauffage","Lämmitysjärjestelmä","Varmesystem"]
["Ventilation system","Lüftungsanlage","Ventilation system","Ventilatiesysteem","sytème de ventilation","Ilmanvaihtojärjestelmä","Ventilationssystem"]
["Heat source system","Wärmequellenanlage","Heat source system","Bronsysteem","système de source de chaleur","Lämmönlähdejärjestelmä","Varmekildesystem"]
["Solar system","Solaranlage","Solar system","Solarsysteem","sytème solaire","Aurinkokeräinjärjestelmä","Solfangersystem"]
["Water","Wasser","Water","Water","eau","Vesi","Vand"]
["Air","Luft","Air","Lucht","air","Ilma","Luft"]
["Ethylen glycol","Ethylenglykol","Ethylen glycol","Ethyleenglycol","éthylène glycol","Etyleeni-glykoli","Ethylenglykol"]
["Ethanol","Ethanol","Ethanol","Ethanol","éthanol","Etanoli","Ethanol"]
["Copper pipe","Kupferrohr","Copper pipe","Koperenleiding","tuyauterie en cuivre","Kupariputki","Kobberrør"]
["PE-Pipe","PE-Rohr","PE-Pipe","PE leiding","tube PE","PE-putki","PE-Rør"]
["Steel pipe","Stahlrohr","Steel pipe","Stalenleiding","tuyaux en acier","Teräsputki","Stålrør"]
["Folded pipe","Wickelfalzrohr","Folded pipe","Wikkelbuis","tuyaux pliés","Taitettu putki","Spirorør"]
["Flat duct LFK","Flachkanal LFK","Flat duct LFK","Platkanaal LFK","conduit plat LFK","Litteä kanava LFK","Flad kanal LFK"]
["Flexible duct LVE","Flexibler Kanal LVE","Flexible duct LVE","Flexibel kanaal LVE","conduit flexible LVE","Joustava kanava LVE","Fleksibel kanal LVE"]
["Flexible pipe LVS","Flexibles Rohr LVS","Flexible pipe LVS","Flexibele buis LVS","tuyau flexible LVS","Joustava putki LVS","Fleksibel kanal LVS"]
["Rectangle duct","Rechteckkanal","Rectangle duct","Rechthoekig kanaal","conduit rectangulaire","Kanttikanava","Retangulert kanal "]
["Pluggit-System","Pluggit-System","Pluggit-System","Pluggit systeem","système PLUGIN","Pluggit-järjestelmä","Pluggit-System"]
["Solar flex pipe","Solar-Flexrohr","Solar flex pipe","Solar-Flexibele buis","tuyau flexible solaire","Aurinkokeräimen joustava putki","Fleksibelt solfangerrør"]
["Flex pipe","Flexrohr","Flex pipe","Flexibele buis","tuyau flexible  ","Joustava putki","Flexrør"]
["Calculated values","Rechenwerte","Calculated values","Berekende waarden","valeurs calculées","Laskenta-arvot","Beregnede værdier"]
["Inside diameter","Innendurchmesser","Inside diameter","Binnendiameter","diamètre intérieur","Sisähalkaisija","Inderdiameret"]
["Hydraulic diameter","Hydraulischer Durchmesser","Hydraulic diameter","Hydraulische diameter","diamètre hydraulique","Hydraulinen halkaisija","Hydrauliske diameter"]
["Cross-section","Querschnittsfläche","Cross-section","Dwarsdoorsnede","coupe transversale","Poikkileikkaus","Tværsnitsareal"]
["Density","Dichte","Density","Dichtheid","densité","Tiheys","Densitet"]
["Kinematic viscosity","Kinematische Viskosität","Kinematic viscosity","Kinematische viscositeit","viscosité cinématique","Kinemaattinen viskositeetti","Kinematisk viskositet"]
["Reynolds number","Reynoldszahl","Reynolds number","Reynoldsgetal","nombre de Reynolds","Reynoldsin luku","Reynolds tal"]
["Surface roughness","Rohrrauhigkeit","Surface roughness","Oppervlakteruwheid","rugosité de la conduite","Pinnan karheus","Overflademodstand"]
["Flow type","Strömungsform","Flow type","Stromingsvorm","type de flux","Virtausmuoto","Strømningstype"]
["Pipe-friction ","Rohrreibungszahl","Pipe-friction ","Leiding wrijvingscoëfficiënt","coefficient de friction de tuyaux","Putken kitka","Rør-friktionskoefficient"]
["Laminar flow","Laminare Strömung","Laminar flow","Laminaire stroming","flux laminaire","Laminaarinen virtaus","Laminar strømning"]
["Turbulent | Hydraulic smooth","Turbulent | Hydraulisch glatt","Turbulent | Hydraulic smooth","Turbulent | Hydraulisch glad","Turbulent | Hydraulique lisse","Turbulenttinen | Hydraulisesti tasainen","Turbulent | Hydraulisk glat"]
["Turbulent | Transition zone","Turbulent | Übergangsgebiet","Turbulent | Transition zone","Turbulent | Overgangsgebied","Turbulent | Zone de transition","Turbulenttinen | Siirtymäkerros","Turbulent | Overgangszone"]
["Turbulent | Hydraulic rough","Turbulent | Hydraulisch rauh","Turbulent | Hydraulic rough","Turbulent | Hydraulisch ruw","Turbulent | Hydraulique rugueuse","Turbulenttinen | Hydraulisesti epätasainen","Turbulent | Hydraulisk ru"]
["Printout","Drucken","Printout","Afdrukken","Imprimer","Tuloste","Udskriv"]
["Zeta-values","Zeta-Werte","Zeta-values","Zeta-values","Zeta-values","Zeta-arvot","Zeta-værdier"]
["Sum","Summe","Sum","Sum","Sum","Summa","Sum"]
["Litres","Liter","Litres","Liter","litres","litraa","Liter"]
["Litres/m","Liter/m","Litres/m","Liter/m","litres/m","litraa/m","Liter/m"]
[]
[]
[]
[]
[]
[]
[]
[]
[]
[]
[]
[]
[]
[]
[]
[]
[]
[]
[]
[]
[]
[]
[]
[]
[]
[]
[]
[]
[]
[]
[]
[]
[]
[]
[]
[]
[]
[]
[]
[]
[]
[]
[]
[]
[]
[]
[]
[]
[]
[]
[]
[]
[]
[]
[]
[]
[]
[]
[]
[]
[]
[]
[]
[]
[]
[]
[]
[]
[]
[]
[]
[]
[]
[]
[]
[]
[]
[]
[]
[]
[]
[]
[]
[]
[]
[]
[]
[]
[]
[]
[]
[]
[]
[]
[]
[]
[]
[]
[]
[]
[]
[]
[]
[]
[]
[]
[]
[]
[]
[]
[]
[]
[]
[]
[]
[]
[]
[]
[]
[]
[]
[]
[]
[]
[]
[]
[]
[]
[]
[]
[]
[]
[]
[]
[]
[]
[]
[]
[]
[]
[]
[]
[]
[]
[]
[]
[]
[]
[]
[]
[]
[]
[]
[]
[]
[]
[]
[]
[]
[]
[]
[]
[]
[]
[]
[]
[]
[]
[]
[]
[]
[]
[]
[]
[]
[]
[]
[]
[]
[]
[]
[]
[]
[]
[]
[]
[]
[]
[]
[]
[]
[]
[]
[]
[]
[]
[]
[]
[]
[]
[]
[]
[]
[]
[]
[]
[]
[]
[]
[]
[]
[]
[]
[]
[]
[]
[]
[]
[]
[]
[]
[]
[]
[]
[]
[]
[]
[]
[]
[]
[]
[]
[]
[]
[]
[]
[]
[]
[]
[]
[]
[]
[]
[]
[]
[]
[]
[]
[]
[]
[]
[]
[]
[]
[]
[]
[]
[]
[]
[]
[]
[]
[]
[]
[]
[]
[]
[]
[]
[]
[]
[]
[]
[]
[]
[]
[]
[]
[]
[]
[]
[]
[]
[]
[]
[]
[]
[]
[]
[]
[]
[]
[]
[]
[]
[]
[]
[]
[]
[]
[]
[]
[]
[]
[]
[]
[]
[]
[]
[]
[]
[]
[]
[]
[]
[]
[]
[]
[]
[]
[]
[]
[]
[]
[]
[]
[]
[]
[]
[]
[]
[]
[]
[]
[]
[]
[]
[]
[]
[]
[]
[]
[]
[]
[]
[]
[]
[]
[]
[]
[]
[]
[]
[]
[]
[]
[]
[]
[]
[]
[]
[]
[]
["Eng",null,"Eng"]
["Eng",null,"Eng"]

{"sheet":"Ausdruck","index":3,"n_rows":24,"n_cols":16,"rows_kept":24,"cut":false,"hidden":true,"merged":[[5,0,5,7],[5,10,5,26],[0,1,0,17],[1,1,1,17],[2,15,2,26],[3,10,3,26],[3,0,3,9],[4,0,4,7],[4,10,4,26],[19,0,19,7],[19,10,19,26],[8,0,8,7],[8,10,8,26],[9,10,9,26],[15,0,15,7],[15,10,15,26],[16,0,16,7],[16,10,16,26],[13,0,13,7],[13,10,13,26],[14,0,14,7],[14,10,14,26],[12,10,12,26],[9,0,9,7],[12,0,12,9],[22,0,22,7],[22,10,22,26],[23,0,23,7],[23,10,23,26],[20,0,20,7],[20,10,20,26],[21,0,21,7],[21,10,21,26],[18,0,18,7],[18,10,18,26],[17,10,17,26],[17,0,17,7],[6,0,6,7],[6,10,6,26],[7,0,7,7],[7,10,7,26],[10,0,10,7],[10,10,10,26]]}
[null,{"$f":"Translation!A3","v":"Pressure loss"}]
[null,{"$f":"Translation!A4","v":"Pipe system"}]
[null,null,null,null,null,null,null,null,null,null,null,null,null,null,null,{"$f":"TODAY()","v":"2015-11-16"}]
[{"$f":"Auswahl!C5","v":"Input values"}]
[{"$f":"Auswahl!C9","v":"Medium"},null,null,null,null,null,null,null,null,null,{"$f":"Berechnung!B5","v":"Water"}]
[{"$f":"Auswahl!C11","v":"Temperature"},null,null,null,null,null,null,null,null,null,{"$f":"Berechnung!F5","v":"60 °C"}]
[{"$f":"Auswahl!C13","v":"Pipe type"},null,null,null,null,null,null,null,null,null,{"$f":"Berechnung!G5","v":"Copper pipe"}]
[{"$f":"IF(Berechnung!L5=TRUE,Translation!A11,Translation!A12&\" x \"&Translation!A13)","v":"Diameter"},null,null,null,null,null,null,null,null,null,{"$f":"IF(Berechnung!L5=TRUE,Berechnung!K5,Berechnung!AC44&\" mm x \"&Berechnung!AD44&\" mm\")","v":"Cu 18 x 1,0"}]
[{"$f":"Translation!A14","v":"Volume flow"},null,null,null,null,null,null,null,null,null,{"$f":"Berechnung!M5&\" \"&Berechnung!N5","v":"160 m³ / h"}]
[{"$f":"Translation!A15","v":"Pipe length"},null,null,null,null,null,null,null,null,null,{"$f":"Berechnung!P5&\" \"&Berechnung!Q5","v":"10 m"}]
[{"$f":"Auswahl!C21","v":"Sum Zeta-values"},null,null,null,null,null,null,null,null,null,{"$f":"Auswahl!D21","v":0}]
[]
[{"$f":"Auswahl!C23","v":"Results"}]
[{"$f":"Translation!A21","v":"Pressure loss"},null,null,null,null,null,null,null,null,null,{"$f":"Auswahl!D25&\" \"&Berechnung!U5","v":"1.815.194,47 mbar"}]
[{"$f":"Translation!A22","v":"Speed"},null,null,null,null,null,null,null,null,null,{"$f":"Auswahl!D27","v":"221,05 m/s"}]
[{"$f":"Translation!A23","v":"Capacity"},null,null,null,null,null,null,null,null,null,{"$f":"Auswahl!D29","v":"2,01 Litres"}]
[{"$f":"Auswahl!H7","v":"Hydraulic diameter"},null,null,null,null,null,null,null,null,null,{"$f":"Auswahl!I7","v":"16,0 mm"}]
[{"$f":"Auswahl!H9","v":"Cross-section"},null,null,null,null,null,null,null,null,null,{"$f":"Auswahl!I9","v":"201 mm²"}]
[{"$f":"Auswahl!H21","v":"Surface roughness"},null,null,null,null,null,null,null,null,null,{"$f":"Auswahl!I21","v":"0,002 mm"}]
[{"$f":"Auswahl!H11","v":"Density"},null,null,null,null,null,null,null,null,null,{"$f":"Auswahl!I11","v":"983,2 kg/m³"}]
[{"$f":"Auswahl!H13","v":"Kinematic viscosity"},null,null,null,null,null,null,null,null,null,{"$f":"Auswahl!I13","v":"0,5 mm²/s"}]
[{"$f":"Auswahl!H15","v":"Reynolds number"},null,null,null,null,null,null,null,null,null,{"$f":"Auswahl!I15","v":"7.368.284"}]
[{"$f":"Auswahl!H17","v":"Flow type"},null,null,null,null,null,null,null,null,null,{"$f":"Auswahl!I17","v":"Turbulent | Transition zone"}]
[{"$f":"Auswahl!H19","v":"Pipe-friction "},null,null,null,null,null,null,null,null,null,{"$f":"Auswahl!I19","v":"0,0121"}]