{"text_format":"1","workbook":"xlsx","n_sheets":4,"sheets":["Eingabe","Zwischenwerte","Klimadaten","Translation"],"not_rendered":{"charts":0,"images":25,"macros":1,"external_links":0,"defined_names":3,"comments":1,"pivot_tables":0},"unopened":[],"bounds":{"document_bytes":16777216,"sheet_cells":100000,"rows_first":2000,"rows_last":500,"rows_between":2000,"halvings":0,"cell_chars":16384,"cell_head_chars":4096},"cells_cut":0,"cells_raw":0,"read":"whole","date_system":"1900"}

{"sheet":"Eingabe","index":0,"n_rows":38,"n_cols":5,"rows_kept":38,"cut":false,"hidden":false,"merged":[[2,26,2,29],[36,3,36,4],[2,1,2,2],[2,7,2,10]]}
[]
[null,{"$f":"Translation!A3","v":"Heat demand by consumption"}]
[null,"IMT/TR 09/12"]
[]
[null,null,null,{"$f":"(Translation!A4)","v":"Building"}]
[]
[null,null,null,{"$f":"(Translation!A5)","v":"Location (enter city)"}]
[]
[null,null,null,{"$f":"Translation!A6","v":"Year of build"}]
[]
[null,null,null,{"$f":"(Translation!A11)","v":"Type of building"}]
[]
[null,null,null,{"$f":"(Translation!A29)","v":"Average room temperature"}]
[]
[null,null,null,{"$f":"(Translation!A30)","v":"Heating system"}]
[]
[null,null,null,{"$f":"(Translation!A31)","v":"Heat generator"}]
[]
[null,null,null,{"$f":"Zwischenwerte!I7","v":"Consumption in m³/year"},2000]
[]
[null,null,null,{"$f":"(Translation!A41)","v":"Usage"}]
[]
[null,null,null,{"$f":"(Translation!A44)","v":"Age of heating system"}]
[]
[null,null,null,{"$f":"(Translation!A48)","v":"DHW production"}]
[]
[null,null,null,{"$f":"(Translation!A49)","v":"DHW type"}]
[]
[null,null,null,{"$f":"Zwischenwerte!O7","v":"Number of persons"},4]
[]
[null,null,null,{"$f":"(Translation!A55)","v":"Demand period"}]
[]
[null,null,null,{"$f":"(Translation!A68)","v":"Summary"}]
[]
[null,null,null,{"$f":"Translation!A69","v":"Heat demand *"},{"$f":"IF(OR(Zwischenwerte!G70<0,ISERROR(Zwischenwerte!G72)),\"---\",FIXED(Zwischenwerte!G72,1)&\" KW\")","v":"9,9 KW"}]
[]
[null,null,"*",{"$f":"(Translation!A70)","v":"Calculation based on DIN EN 12831 Supplement 2, may 2010"}]
[null,null,null,{"$f":"Translation!A71","v":0}]

{"sheet":"Zwischenwerte","index":1,"n_rows":72,"n_cols":23,"rows_kept":72,"cut":false,"hidden":true,"merged":[[65,10,68,10],[2,19,3,20],[2,21,3,22],[2,7,3,10],[2,13,3,16],[2,17,3,18],[65,16,68,16],[56,10,64,10],[56,16,64,16]]}
[]
[null,null,null,null,"Comoboxen"]
[null,null,null,null,null,null,null,"Energieverbrauch",null,null,null,null,null,"Gebäudetyp /WW-Bedarf",null,null,null,"Art WWB",null,"Bedarfzeitraum WWB",null,"Sprache ändern"]
[null,null,null,null,"Standort","Baujahr","Raumtemp",null,null,null,null,"Nutzungsart","Alter Heizung"]
[null,null,null,null,null,null,null,"Combobox","Einheit","Heizwert","Jährlicher Verbrauch",null,null,"Gebäudetyp /WW-Bedarf","spez Bedarf (Bezug)","Durchschnittsbedarf","Spez. Bedarf (Wert)","Combobox",null,"Combobox","d/a"]
[]
[null,null,null,null,"Holzminden","1980 - 1994","20 °C","Gas boiler",{"$f":"VLOOKUP(H7,H9:I28,2,FALSE)","v":"Consumption in m³/year"},{"$f":"VLOOKUP(H7,H9:J28,3,FALSE)","v":10.4},{"$f":"Eingabe!E19","v":2000},"Heating only","From 1995","Einfamilienhaus",{"$f":"VLOOKUP(N7,N9:O28,2,FALSE)","v":"Number of persons"},{"$f":"VLOOKUP(N7,N9:P29,3,FALSE)","v":1.1000000000000001},{"$f":"Eingabe!E29","v":4},"Building-central without circulation",null,"All year",{"$f":"VLOOKUP(T7,T9:U29,2,FALSE)","v":365},2,{"$f":"VLOOKUP(V7,V9:W29,2,FALSE)","v":"| English"}]
[]
[]
[null,null,null,null,null,{"$f":"(Translation!A7)","v":"From 2009"},"18 °C",{"$f":"Translation!A32","v":"Gas boiler"},{"$f":"Translation!A73","v":"Consumption in m³/year"},10.4,null,{"$f":"(Translation!A42)","v":"Heating only"},{"$f":"Translation!A47","v":"From 1995"},"Einfamilienhaus",{"$f":"Translation!A76","v":"Number of persons"},1.1000000000000001,null,{"$f":"(Translation!A50)","v":"Building-central without circulation"},null,{"$f":"(Translation!A56)","v":"All year"},365,1,"| Deutsch"]
[null,null,null,null,null,{"$f":"(Translation!A8)","v":"1995 - 2008"},"19 °C",{"$f":"Translation!A33","v":"Oil boiler"},{"$f":"Translation!A72","v":"Consumption in l/year"},10.08,null,{"$f":"(Translation!A43)","v":"Heating | DHW"},{"$f":"Translation!A46","v":"1980 - 1994"},"Mehrfamilienhaus",{"$f":"Translation!A76","v":"Number of persons"},1.1000000000000001,null,{"$f":"(Translation!A51)","v":"Building-central with circulation"},null,{"$f":"(Translation!A57)","v":"1 month / year"},30.4,2,"| English"]
[null,null,null,null,null,{"$f":"(Translation!A9)","v":"1980 - 1994"},"20 °C",{"$f":"Translation!A34","v":"Condensing gas boiler"},{"$f":"Translation!A73","v":"Consumption in m³/year"},10.4,null,null,{"$f":"Translation!A45","v":"Before 1980"},{"$f":"(Translation!A13)","v":"Office building"},{"$f":"Translation!A76","v":"Number of persons"},0.4,null,{"$f":"Translation!A52","v":"Apartment-central"},null,{"$f":"(Translation!A58)","v":"2 months / year"},60.8,3,"| Nederlands"]
[null,null,null,null,null,{"$f":"(Translation!A10)","v":"Before 1980"},"21 °C",{"$f":"Translation!A35","v":"Condensing oil boiler"},{"$f":"Translation!A72","v":"Consumption in l/year"},10.08,null,null,null,{"$f":"(Translation!A14)","v":"Hospital"},{"$f":"Translation!A77","v":"Number of beds"},6,null,{"$f":"(Translation!A53)","v":"Apartment-decentral"},null,{"$f":"(Translation!A59)","v":"3 months / year"},91.199999999999989]
[null,null,null,null,null,null,"22 °C",{"$f":"Translation!A36","v":"Storage heater"},{"$f":"Translation!A74","v":"Consumption in kWh/year"},1,null,null,null,{"$f":"(Translation!A15)","v":"School (without showers)"},{"$f":"Translation!A76","v":"Number of persons"},0.4,null,null,null,{"$f":"(Translation!A60)","v":"4 months / year"},121.6]
[null,null,null,null,null,null,null,{"$f":"Translation!A37","v":"Electric heating"},{"$f":"Translation!A74","v":"Consumption in kWh/year"},1,null,null,null,{"$f":"(Translation!A16)","v":"School (with showers)"},{"$f":"Translation!A76","v":"Number of persons"},1.5,null,null,null,{"$f":"(Translation!A61)","v":"5 months / year"},152]
[null,null,null,null,null,null,null,{"$f":"Translation!A38","v":"District heating"},{"$f":"Translation!A74","v":"Consumption in kWh/year"},1,null,null,null,{"$f":"(Translation!A17)","v":"Retailer / Store"},{"$f":"Translation!A78","v":"Number of employees"},1,null,null,null,{"$f":"(Translation!A62)","v":"6 months / year"},182.4]
[null,null,null,null,null,null,null,{"$f":"Translation!A39","v":"Pellet"},{"$f":"Translation!A75","v":"Consumption in kg/year"},4.9000000000000004,null,null,null,{"$f":"(Translation!A18)","v":"Garage (with showers)"},{"$f":"Translation!A78","v":"Number of employees"},1.8,null,null,null,{"$f":"(Translation!A63)","v":"7 months / year"},212.8]
[null,null,null,null,null,null,null,{"$f":"Translation!A40","v":"Other"},{"$f":"Translation!A74","v":"Consumption in kWh/year"},1,null,null,null,{"$f":"(Translation!A19)","v":"Hotel (Standard)"},{"$f":"Translation!A77","v":"Number of beds"},1.9,null,null,null,{"$f":"(Translation!A64)","v":"8 months / year"},243.20000000000002]
[null,null,null,null,null,null,null,null,null,null,null,null,null,{"$f":"(Translation!A20)","v":"Hotel (High standard)"},{"$f":"Translation!A77","v":"Number of beds"},3.5,null,null,null,{"$f":"(Translation!A65)","v":"9 months / year"},273.60000000000002]
[null,null,null,null,null,null,null,null,null,null,null,null,null,{"$f":"(Translation!A21)","v":"Hotel (Luxury)"},{"$f":"Translation!A77","v":"Number of beds"},5.5,null,null,null,{"$f":"(Translation!A66)","v":"10 months / year"},304]
[null,null,null,null,null,null,null,null,null,null,null,null,null,{"$f":"(Translation!A22)","v":"Restaurant"},{"$f":"Translation!A79","v":"Number of seats"},1.1000000000000001,null,null,null,{"$f":"(Translation!A67)","v":"11 months / year"},334.4]
[null,null,null,null,null,null,null,null,null,null,null,null,null,{"$f":"(Translation!A23)","v":"Nursing home"},{"$f":"Translation!A76","v":"Number of persons"},2.2999999999999998]
[null,null,null,null,null,null,null,null,null,null,null,null,null,{"$f":"(Translation!A24)","v":"Barracks"},{"$f":"Translation!A76","v":"Number of persons"},1.8]
[null,null,null,null,null,null,null,null,null,null,null,null,null,{"$f":"(Translation!A25)","v":"Sports facility (with showers)"},{"$f":"Translation!A76","v":"Number of persons"},1.8]
[null,null,null,null,null,null,null,null,null,null,null,null,null,{"$f":"(Translation!A26)","v":"Bakery"},{"$f":"Translation!A78","v":"Number of employees"},5]
[null,null,null,null,null,null,null,null,null,null,null,null,null,{"$f":"(Translation!A27)","v":"Hairdresser"},{"$f":"Translation!A78","v":"Number of employees"},6]
[null,null,null,null,null,null,null,null,null,null,null,null,null,{"$f":"(Translation!A28)","v":"Butcher (with production)"},{"$f":"Translation!A78","v":"Number of employees"},18]
[null,null,null,null,"Stadt eingetragen"]
[null,null,null,null,{"$f":"IF(OR(E7=\"\",ISERROR(VLOOKUP(E7,Klimadaten!B:B,1,FALSE))),FALSE,TRUE)","v":true}]
[]
[]
[]
[]
[]
[]
[]
[]
[]
[]
[]
[]
[]
[]
[]
[]
[]
[]
[]
[]
[]
[]
[]
[]
[]
[null,null,null,null,"Belastungsgrad",null,null,"Heizstunden proJahr",null,null,"Nutzungsgrade"]
[null,null,null,null,"Norm-Außentemp",{"$f":"VLOOKUP(E7,Klimadaten!B:D,2,FALSE)","v":-12},null,{"$f":"F10","v":"From 2009"},{"$f":"VLOOKUP($E$7,Klimadaten!$B:$H,4,FALSE)*24","v":4392},null,null,null,{"$f":"M12","v":"Before 1980"},{"$f":"M11","v":"1980 - 1994"},{"$f":"M10","v":"From 1995"},"Gewählt","Gewählt"]
[null,null,null,null,"Jahresmittel-Temp",{"$f":"VLOOKUP(E7,Klimadaten!B:D,3,FALSE)","v":9.73},null,{"$f":"F11","v":"1995 - 2008"},{"$f":"VLOOKUP($E$7,Klimadaten!$B:$H,5,FALSE)*24","v":5184},null,"Heizung",{"$f":"H10","v":"Gas boiler"},0.78,0.83,0.88,{"$f":"HLOOKUP($M$7,$M$56:$O$69,2,FALSE)","v":0.88},{"$f":"VLOOKUP(H7,L57:Q65,5,FALSE)","v":0.88}]
[null,null,null,null,"Norm-Innentemp.",{"$f":"LEFT(G7,FIND(\" \",G7)-1)","v":"20"},null,"1980 - 1994",{"$f":"VLOOKUP($E$7,Klimadaten!$B:$H,6,FALSE)*24","v":5772},null,null,{"$f":"H11","v":"Oil boiler"},0.78,0.83,0.88,{"$f":"HLOOKUP($M$7,$M$56:$O$69,3,FALSE)","v":0.88}]
[null,null,null,null,"Belastungsgrad WE",{"$f":"(F58-F57)/(F58-F56)","v":0.32093749999999999},null,"Before 1980",{"$f":"VLOOKUP($E$7,Klimadaten!$B:$H,7,FALSE)*24","v":6360},null,null,"Condensing gas boiler","---",0.87,0.92,{"$f":"HLOOKUP($M$7,$M$56:$O$69,4,FALSE)","v":0.92}]
[null,null,null,null,null,null,null,null,null,null,null,"Condensing oil boiler","---",0.87,0.92,{"$f":"HLOOKUP($M$7,$M$56:$O$69,5,FALSE)","v":0.92}]
[null,null,null,null,null,null,null,null,null,null,null,"Storage heater",1,1,1,{"$f":"HLOOKUP($M$7,$M$56:$O$69,6,FALSE)","v":1}]
[null,null,null,null,null,null,null,"th  h/a",{"$f":"VLOOKUP(F7,H56:I59,2,FALSE)","v":5772},null,null,"Electric heating",1,1,1,{"$f":"HLOOKUP($M$7,$M$56:$O$69,7,FALSE)","v":1}]
[null,null,null,null,null,null,null,null,null,null,null,"District heating","---",0.87,0.92,{"$f":"HLOOKUP($M$7,$M$56:$O$69,8,FALSE)","v":0.92}]
[null,null,null,null,null,null,null,"Vollbenutzungsstunden",{"$f":"I62*F59","v":1852.4512499999998},null,null,"Pellet","---","---",0.85,{"$f":"HLOOKUP($M$7,$M$56:$O$69,9,FALSE)","v":0.85}]
[null,null,null,null,null,null,null,null,null,null,null,"Other",0.78,0.83,0.88,{"$f":"HLOOKUP($M$7,$M$56:$O$69,10,FALSE)","v":0.88}]
[null,null,null,null,"Energie",null,null,null,null,null,"WWB",{"$f":"R10","v":"Building-central without circulation"},0.5,0.6,0.7,{"$f":"HLOOKUP($M$7,$M$56:$O$69,11,FALSE)","v":0.7},{"$f":"VLOOKUP(R7,L66:Q69,5,FALSE)","v":0.7}]
[null,null,null,null,"Gesamt-Verbrauch [kWh/a]","E-G,in",{"$f":"J7*K7","v":20800},null,null,null,null,{"$f":"R11","v":"Building-central with circulation"},{"$f":"IF(N7=N10,0.2,0.3)","v":0.2},{"$f":"IF(N7=N10,0.3,0.45)","v":0.3},{"$f":"IF(N7=N10,0.4,0.6)","v":0.4},{"$f":"HLOOKUP($M$7,$M$56:$O$69,12,FALSE)","v":0.4}]
[null,null,null,null,"Bedarf WWB [kWh/a]","QW,b",{"$f":"IF(L7=L10,0,P7*Q7*U7)","v":0},null,null,null,null,{"$f":"R12","v":"Apartment-central"},0.7,0.77500000000000002,0.85,{"$f":"HLOOKUP($M$7,$M$56:$O$69,13,FALSE)","v":0.85}]
[null,null,null,null,"Verbrauch WWB [kWh/a]","E-W,g,In",{"$f":"G68/Q66","v":0},null,null,null,null,{"$f":"R13","v":"Apartment-decentral"},0.8,0.875,0.95,{"$f":"HLOOKUP($M$7,$M$56:$O$69,14,FALSE)","v":0.95}]
[null,null,null,null,"Verbrauch heizung [kWh/a]","E-H,G,In",{"$f":"G67-G69","v":20800}]
[null,null,null,null,"Feuerungsleitung","Phi-H,G,In",{"$f":"G70/(I62*F59)","v":11.228365658745407}]
[null,null,null,null,"Heizlast","Phi,H,G,Out",{"$f":"G71*Q57","v":9.8809617796959586}]

{"sheet":"Klimadaten","index":2,"n_rows":10194,"n_cols":8,"rows_kept":10194,"cut":false,"hidden":true,"merged":[[0,0,0,7]]}
["Deutschland"]
["PLZ","Stadt","Norm-Außentemp.","Jahres-Mitteltemp.","Heiztage Neubau Heizgrenze 10°C","Heiztage ab 1995 Heizgrenze 12°C","Heiztage 1980-1995 Heizgrenze 13,5°C","Heiztage vor 1980 Heizgrenze 15°C"]
["1....","Berlin",-14,9.83,182,211,234,257]
["22...","Hamburg",-12,9.2200000000000006,192,225,253.5,282]
["8....","München",-16,9.07,190,218,241.5,265]
["5....","Köln",-10,10.66,170,202,230,258]
["60...","Frankfurt / Main",-12,10.37,176,205,228.5,252]
["7....","Stuttgart",-12,9.26,190,221,245,269]
["44...","Dortmund",-12,10.7,170,202,230,258]
["40...","Düsseldorf",-10,10.66,170,202,230,258]
["45...","Essen",-10,10.7,170,202,230,258]
["28...","Bremen",-12,9.4,190,223,252,281]
["30...","Hannover",-14,9.44,187,220,247.5,275]
["04...","Leipzig",-14,9.3699999999999992,188,218,242.5,267]
["010..","Dresden",-14,9.2899999999999991,189,219,242.5,266]
["904..","Nürnberg",-16,9.2200000000000006,192,220,243.5,267]
["1805.","Rostock",-10,9.0399999999999991,196,226,253.5,281]
["72280","Aach",-16,9.26,190,221,245,269]
["78267","Aach/Hegau",-14,9.7100000000000009,186,214,237.5,261]
["520..","Aachen",-12,10.24,176,211,239.5,268]
["7343.","Aalen / Württ.",-16,9.26,190,221,245,269]
["65326","Aarbergen",-14,8.4700000000000006,205,240,267.5,295]
["19322","Abbendorf",-14,8.89,197,227,255,283]
["30900","Abbensen",-14,9.44,187,220,247.5,275]
["31234","Abbensen",-14,9.44,187,220,247.5,275]
["93326","Abensberg",-18,8.76,194,222,244.5,267]
["08485","Abhorn",-16,8.43,202,233,258.5,284]
["37290","Abterode",-16,9.73,183,216,240.5,265]
["04347","Abtnaundorf",-14,9.3699999999999992,188,218,242.5,267]
["94261","Abtschlag",-18,8.76,194,222,244.5,267]
["73453","Abtsgmünd",-16,9.26,190,221,245,269]
["69518","Abtsteinach",-12,9.5500000000000007,186,216,240.5,265]
["83101","Achenmühle",-18,7.01,227,260,283,306]
["77855","Achern",-12,10.86,169,197,221,245]
["28832","Achim",-12,9.4,190,223,252,281]
["82547","Achmühle",-16,7.42,217,249,272.5,296]
["88480","Achstetten",-16,9.26,190,221,245,269]
["47626","Achterhoek",-10,10.66,170,202,230,258]
["25917","Achtrup",-10,8.51,204,239,269.5,300]
["37581","Ackenhausen",-16,9.73,183,216,240.5,265]
["73099","Adelberg",-16,9.26,190,221,245,269]
["37139","Adelebsen",-14,9.73,183,216,240.5,265]
["79618","Adelhausen",-12,9.26,190,221,245,269]
["73486","Adelmannsfelden",-16,9.26,190,221,245,269]
["79669","Adelsberg",-16,9.26,190,221,245,269]
["97737","Adelsberg",-14,9.5500000000000007,186,216,240.5,265]
["85111","Adelschlag",-16,9.07,190,218,241.5,265]
["74740","Adelsheim",-14,9.26,190,221,245,269]
["86477","Adelsried",-16,10.24,200,230,254,278]
["04886","Adelwitz",-16,9.3699999999999992,188,218,242.5,267]
["21365","Adendorf",-12,9.2200000000000006,192,225,253.5,282]
["31171","Adensen",-14,9.44,187,220,247.5,275]
["31079","Adenstedt",-16,9.44,187,220,247.5,275]
["84166","Adlkofen",-16,8.76,194,222,244.5,267]
["08626","Adorf/Vogtland",-18,7.71,213,246,270,294]
["31855","Aerzen",-14,9.44,187,220,247.5,275]
["71563","Affalterbach",-14,9.26,190,221,245,269]
["74182","Affaltrach",-14,9.26,190,221,245,269]
["86444","Affing",-16,10.24,200,230,254,278]
["71083","Affstätt",-16,9.26,190,221,245,269]
["74858","Aglasterhausen",-12,9.26,190,221,245,269]
["48683","Ahaus",-10,9.44,187,220,247.5,275]
["88697","Ahausen",-12,9.26,190,221,245,269]
["72160","Ahldorf",-16,9.26,190,221,245,269]
["5922.","Ahlen/Westf.",-12,8.4700000000000006,205,240,267.5,295]
["06313","Ahlsdorf",-14,9.3699999999999992,188,218,242.5,267]
["32609","Ahlsen",-12,9.73,183,216,240.5,265]
["34292","Ahnatal",-14,9.73,183,216,240.5,265]
["29353","Ahnsbeck",-14,9.44,187,220,247.5,275]
["94527","Aholming",-18,8.76,194,222,244.5,267]
["96482","Ahorn",-16,9.0299999999999994,194,223,247,271]
["74744","Ahorn",-16,9.26,190,221,245,269]
["95491","Ahorntal",-16,6.95,226,258,280.5,303]
["38707","Ahrensberg",-12,9.3000000000000007,189,219,245,271]
["22926","Ahrensburg",-12,9.2200000000000006,192,225,253.5,282]
["16356","Ahrensfelde",-14,9.14,194,221,246.5,272]
["18320","Ahrenshagen",-10,9.0399999999999991,196,226,253.5,281]
["53945","Ahrhütte",-14,8.4700000000000006,205,240,267.5,295]
["86551","Aichach",-16,10.24,200,230,254,278]
["92262","Aichach",-16,9.2200000000000006,192,220,243.5,267]
["72539","Aichelau",-16,9.26,190,221,245,269]
["73101","Aichelberg",-16,9.26,190,221,245,269]
["75323","Aichelberg",-16,9.26,190,221,245,269]
["78733","Aichhalden",-16,9.26,190,221,245,269]
["88317","Aichstetten",-16,9.26,190,221,245,269]
["72631","Aichtal",-14,9.26,190,221,245,269]
["73773","Aichwald",-14,9.26,190,221,245,269]
["84539","Aidenbach",-16,8.76,194,222,244.5,267]
["94501","Aidenbach",-16,8.76,194,222,244.5,267]
["97491","Aidhausen",-16,9.5500000000000007,186,216,240.5,265]
["71134","Aidlingen",-16,9.26,190,221,245,269]
["88448","Aigendorf",-16,9.26,190,221,245,269]
["88048","Ailingen",-12,9.7100000000000009,186,214,237.5,261]
["86447","Aindling",-16,10.24,200,230,254,278]
["83404","Ainring",-16,7.01,227,260,283,306]
["83026","Aising",-18,7.01,227,260,283,306]
["89344","Aislingen",-16,10.24,200,230,254,278]
["94330","Aiterhofen",-18,8.76,194,222,244.5,267]
["88319","Aitrach",-16,9.26,190,221,245,269]
["78554","Aixheim",-18,9.26,190,221,245,269]
["37671","Albaxen",-12,9.73,183,216,240.5,265]
["79774","Albbruck",-12,9.26,190,221,245,269]
["08280","Albernau",-16,7.71,213,246,270,294]
["08280","Alberoda",-16,7.71,213,246,270,294]
["04420","Albersdorf",-14,9.3699999999999992,188,218,242.5,267]
["25767","Albersdorf, Holst",-12,8.51,204,239,269.5,300]
["73095","Albershausen",-16,9.26,190,221,245,269]
["76857","Albersweiler",-12,9.36,191,223,248.5,274]
["88433","Alberweiler",-16,9.26,190,221,245,269]
["72458","Albstadt",-18,9.26,190,221,245,269]
["72461","Albstadt",-18,9.26,190,221,245,269]
["57258","Alchen",-12,8.4700000000000006,205,240,267.5,295]
["52457","Aldenhoven",-12,10.24,176,211,239.5,268]
["94501","Aldersbach",-16,8.76,194,222,244.5,267]
["78554","Aldingen",-18,9.26,190,221,245,269]
["86733","Alerheim",-16,10.24,200,230,254,278]
["91793","Alesheim",-16,9.2200000000000006,192,220,243.5,267]
["73553","Alfdorf",-16,9.26,190,221,245,269]
["31061","Alfeld",-16,9.44,187,220,247.5,275]
["91236","Alfeld",-16,9.2200000000000006,192,220,243.5,267]
{"$rows_left_out":10075}
{"sheet":"Translation","index":3,"n_rows":79,"n_cols":10,"rows_kept":79,"cut":false,"hidden":true,"merged":[]}
[]
["English/Englisch","Deutsch","English/Englisch","Holländisch",null,null,"Norskt/Norwegisch","Suomi/Finnisch","Spanisch","Estonian"]
["Heat demand by consumption","Heizlast nach Verbrauchsdaten","Heat demand by consumption","Verwarmingsvermogen"]
["Building","Gebäude","Building","Object"]
["Location (enter city)","Standort (Eingabe Stadt)","Location (enter city)","Plaats object"]
["Year of build","Baujahr","Year of build","Bouwjaar"]
["From 2009","Ab 2009","From 2009","Vanaf 2009"]
["1995 - 2008","1995 - 2008","1995 - 2008","1995-2008"]
["1980 - 1994","1980 - 1994","1980 - 1994","1980-1994"]
["Before 1980","Vor 1980","Before 1980","Voor 1980"]
["Type of building","Gebäudetyp","Type of building","Type Gebouw"]
["Residential building","Wohngebäude","Residential building","Woningbouw"]
["Office building","Bürogebäude","Office building","Utiliteit"]
["Hospital","Krankenhaus","Hospital","Ziekenhuis"]
["School (without showers)","Schule (ohne Duschen)","School (without showers)","School"]
["School (with showers)","Schule (mit Duschen)","School (with showers)","School met douchefaciliteit"]
["Retailer / Store","Einzelhandel/Kaufhaus","Retailer / Store","Handelsbedrijf"]
["Garage (with showers)","Werkstatt (mit Duschen)","Garage (with showers)","Werkplaats met douchefaciliteit"]
["Hotel (Standard)","Hotel (Standard)","Hotel (Standard)","Hotel (standaard)"]
["Hotel (High standard)","Hotel (Gehobener Standard)","Hotel (High standard)","Hotel (bovengemiddeld Luxe)"]
["Hotel (Luxury)","Hotel (Luxus)","Hotel (Luxury)","Hotel (luxe)"]
["Restaurant","Gaststätte","Restaurant","Gastenverblijf"]
["Nursing home","Heim","Nursing home","Bejaardenhuis"]
["Barracks","Kaserne","Barracks","Kazerne"]
["Sports facility (with showers)","Sportanlage (Mit Dusche)","Sports facility (with showers)","Sporthal (Met douchefaciliteit)"]
["Bakery","Bäckerei","Bakery","Bakkerij"]
["Hairdresser","Friseur","Hairdresser","Kapper"]
["Butcher (with production)","Fleischerei mit Produktion","Butcher (with production)","Slager met slachterij"]
["Average room temperature","Mittlere Innentemperatur","Average room temperature","Gemmidelde Ruimtemperatuur"]
["Heating system","Heizungsanlage","Heating system","Verwarmingsinstallatie"]
["Heat generator","Wärmeerzeuger","Heat generator","Verwarmingsbron"]
["Gas boiler","NT-Kessel Gas","Gas boiler","VR Gasketel"]
["Oil boiler","NT-Kessel Öl","Oil boiler","VR Olieketel"]
["Condensing gas boiler","Brennwertkessel Gas","Condensing gas boiler","HR gasketel"]
["Condensing oil boiler","Brennwertkessel Öl","Condensing oil boiler","HR Olieketel"]
["Storage heater","Wärmespeicher","Storage heater","Buffervat"]
["Electric heating","Elektro-Direktheizung","Electric heating","Directe Electrische verwarming"]
["District heating","Fernwärme","District heating","Stadsverwarming"]
["Pellet","Pelletkessel","Pellet","Palletketel"]
["Other","Sonstige","Other","Overige soorten"]
["Usage","Nutzungsart","Usage","Bedrijfswijze"]
["Heating only","Nur Heizung","Heating only","Alleen verwarming"]
["Heating | DHW","Heizung | Warmwasserbereitung","Heating | DHW","Verwarming/tapwaterbereiding"]
["Age of heating system","Alter Heizungsanlage","Age of heating system","Bestaande Verwarmingsinstallatie"]
["Before 1980","Vor 1980","Before 1980","Voor 1980"]
["1980 - 1994","1980 - 1994","1980 - 1994","1980-1994"]
["From 1995","Ab 1995","From 1995","Vanaf 1994"]
["DHW production","Warmwasserbereitung","DHW production","Tapwaterbereiding"]
["DHW type","Art der Warmwasserbereitung","DHW type","Type tapwaterbereiding"]
["Building-central without circulation","Gebäudezentral ohne Zirkulation","Building-central without circulation","Centrale opwekking zonder circulatieleiding"]
["Building-central with circulation","Gebäudezentral mit Zirkulation","Building-central with circulation","Centrale opwekking met circulatieleiding"]
["Apartment-central","Wohnungszentral","Apartment-central","Centrale opwekking"]
["Apartment-decentral","Dezentral (Einzelversorgung)","Apartment-decentral","Decentrale opwekking"]
["Number of residents","Anzahl Personen","Number of residents","Aantal Personen"]
["Demand period","Bedarfszeitraum","Demand period","Periode waarin behoefte is"]
["All year","Ganzjährig","All year","Gehele jaar"]
["1 month / year","1 Monat / Jahr","1 month / year","1 Maand/Jaar"]
["2 months / year","2 Monate / Jahr","2 months / year","2 Maanden/Jaar"]
["3 months / year","3 Monate / Jahr","3 months / year","3 Maanden/Jaar"]
["4 months / year","4 Monate / Jahr","4 months / year","4 Maanden/Jaar"]
["5 months / year","5 Monate / Jahr","5 months / year","5 Maanden/Jaar"]
["6 months / year","6 Monate / Jahr","6 months / year","6 Maanden/Jaar"]
["7 months / year","7 Monate / Jahr","7 months / year","7 Maanden/Jaar"]
["8 months / year","8 Monate / Jahr","8 months / year","8 Maanden/Jaar"]
["9 months / year","9 Monate / Jahr","9 months / year","9 Maanden/Jaar"]
["10 months / year","10 Monate / Jahr","10 months / year","10 Maanden/Jaar"]
["11 months / year","11 Monate / Jahr","11 months / year","11 Maanden/Jaar"]
["Summary","Ergebnis","Summary","Uitkomst"]
["Heat demand *","Gebäudeheizlast *","Heat demand *","Transmissieverlies"]
["Calculation based on DIN EN 12831 Supplement 2, may 2010","Entspricht der Wärmeerzeuger-Nennleistung. Die Norm-Gebäudeheizlast kann höher ausfallen, da interne und solare Wärmeeinträge (Fremdwärmegewinne) nicht berücksichtigt sind.","Calculation based on DIN EN 12831 Supplement 2, may 2010","Is volgens een normberekening, het officiele transmissieverlies kan hoger zijn omdat interne warmtelast en externe invloeden zoals zonlichttoetreding niet meegenomen zijn."]
[null,"Berechnung nach DIN EN 12831 Beiblatt 2 (Stand Mai 2012)",null,"Berekening volgens DIN EN 12831 Tapblad 2, stand mei 2012"]
["Consumption in l/year","Verbrauch in Liter/Jahr","Consumption in l/year","Verbruik in l/jr"]
["Consumption in m³/year","Verbrauch in m³/Jahr","Consumption in m³/year","Verbruik in m3/jr"]
["Consumption in kWh/year","Verbrauch in kWh/Jahr","Consumption in kWh/year","Verbruik in kWh/jr"]
["Consumption in kg/year","Verbrauch in kg/Jahr","Consumption in kg/year","Verbruik in kg/jr"]
["Number of persons","Anzahl Personen","Number of persons","Aantal Personen"]
["Number of beds","Anzahl Betten","Number of beds","Aantal bedden"]
["Number of employees","Anzahl Beschäftigte","Number of employees","Aantal medewerkers"]
["Number of seats","Anzahl Sitzplätze","Number of seats","Aantal zitplaatsen"]